[torqueusers] TORQUE 4.0.1 release candidate available

DuChene, StevenX A stevenx.a.duchene at intel.com
Tue Apr 3 17:22:45 MDT 2012


Sorry, I sent the message below out before I noticed or got to read your follow up message with the new snapshot.

I will try that now as soon as I finish downloading it to my development systems.

Thanks for the update. I will let you know how the build goes.

BTW, I tried subscribing to the torque-devel list but I think it was during the issues with the mail server and thus I did not get a valid subscription request that went through.
--
Steven DuChene

From: torqueusers-bounces at supercluster.org [mailto:torqueusers-bounces at supercluster.org] On Behalf Of David Beer
Sent: Tuesday, April 03, 2012 4:19 PM
To: Torque Users Mailing List
Cc: Torque Developers mailing list
Subject: Re: [torqueusers] TORQUE 4.0.1 release candidate available

Are you certain you used the correct tarball? I am able to build the new one and not the old one. Also:

dbeer at napali:/home/dbeer/Downloads/torque-4.0.1#<mailto:dbeer at napali:/home/dbeer/Downloads/torque-4.0.1#> ls src/resmom/| grep mom_job_func.h
mom_job_func.h

David

On Tue, Apr 3, 2012 at 5:14 PM, DuChene, StevenX A <stevenx.a.duchene at intel.com<mailto:stevenx.a.duchene at intel.com>> wrote:
I also download the snapshot file again on a completely different system and the mom_job_func.h file is still not present.

I tried the same build over on that system from that newly downloaded snapshot file and if failed in the same spot due to the missing include file.
--
Steven DuChene

From: torqueusers-bounces at supercluster.org<mailto:torqueusers-bounces at supercluster.org> [mailto:torqueusers-bounces at supercluster.org<mailto:torqueusers-bounces at supercluster.org>] On Behalf Of DuChene, StevenX A

Sent: Tuesday, April 03, 2012 3:03 PM
To: Torque Users Mailing List; Torque Developers mailing list
Subject: Re: [torqueusers] TORQUE 4.0.1 release candidate available

Tried to use the packaged spec file in the snapshot to build rpms but it failed. It seems that a referenced include file is missing or the name is misspelled.

gcc -DHAVE_CONFIG_H -I. -I../../src/include  -I../../src/include -I../../src/resmom/linux -DPBS_MOM -DDEMUX=\"/usr/sbin/pbs_demux\" -DRCP_PATH=\"/usr/bin/scp\" -DRCP_ARGS=\"-rpB\" -DPBS_SERVER_HOME=\"/var/spool/torque\" -DPBS_ENVIRON=\"/var/spool/torque/pbs_environment\"   -O2 -g -pipe -Wall -Wp,-D_FORTIFY_SOURCE=2 -fexceptions -fstack-protector --param=ssp-buffer-size=4 -m64 -mtune=generic -c -o job_recov.o `test -f '../server/job_recov.c' || echo './'`../server/job_recov.c
mom_comm.c:127:42: error: mom_job_func.h: No such file or directory
mom_process_request.c:43:42: error: mom_job_func.h: No such file or directory
mom_process_request.c: In function 'close_quejob':
mom_process_request.c:540: warning: implicit declaration of function 'job_purge'
catch_child.c:38:42: error: mom_job_func.h: No such file or directory
mom_comm.c: In function 'im_join_job_as_sister':
mom_comm.c:2427: warning: implicit declaration of function 'job_purge'
make[3]: *** [mom_process_request.o] Error 1
make[3]: *** Waiting for unfinished jobs....
mom_main.c:81:42: error: mom_job_func.h: No such file or directory
catch_child.c: In function 'mom_deljob':
catch_child.c:2008: warning: implicit declaration of function 'job_purge'
mom_req_quejob.c:106:42: error: mom_job_func.h: No such file or directory
make[3]: *** [catch_child.o] Error 1
mom_req_quejob.c: In function 'req_quejob':
mom_req_quejob.c:353: warning: implicit declaration of function 'job_purge'
mom_main.c: In function 'rm_request':
mom_main.c:4496: warning: implicit declaration of function 'job_purge'
make[3]: *** [mom_req_quejob.o] Error 1
make[3]: *** [mom_comm.o] Error 1
make[3]: *** [mom_main.o] Error 1
make[3]: Leaving directory `/root/rpmbuild/BUILD/torque-4.0.1-snap.201204031514/src/resmom'
make[2]: *** [all-recursive] Error 1
make[2]: Leaving directory `/root/rpmbuild/BUILD/torque-4.0.1-snap.201204031514/src/resmom'
make[1]: *** [all-recursive] Error 1
make[1]: Leaving directory `/root/rpmbuild/BUILD/torque-4.0.1-snap.201204031514/src'
make: *** [all-recursive] Error 1
error: Bad exit status from /var/tmp/rpm-tmp.9L8CSg (%build)

From: torqueusers-bounces at supercluster.org<mailto:torqueusers-bounces at supercluster.org> [mailto:torqueusers-bounces at supercluster.org] On Behalf Of Ken Nielson
Sent: Tuesday, April 03, 2012 2:43 PM
To: torqueusers; Torque Developers mailing list
Subject: [torqueusers] TORQUE 4.0.1 release candidate available

Hi all,

There is a TORQUE 4.0.1 release candidate available for download. There are several bug fixes and code refactoring over the 4.0.0 release. Please see the CHANGELOG for a list of bug fixes and enhancements.

The code can be downloaded from http://www.adaptivecomputing.com/resources/downloads/torque/snapshots/torque-4.0.1-snap.201204031514.tar.gz<http://www.adaptivecomputing.com/resources/downloads/torque/snapshots/torque-4.0.1-snap.201204031514.tar.gz>

Please download this and let us know what problems you find.

Regards

Ken Nielson

_______________________________________________
torqueusers mailing list
torqueusers at supercluster.org<mailto:torqueusers at supercluster.org>
http://www.supercluster.org/mailman/listinfo/torqueusers



--
David Beer | Software Engineer
Adaptive Computing

-------------- next part --------------
An HTML attachment was scrubbed...
URL: http://www.supercluster.org/pipermail/torqueusers/attachments/20120403/f3c90f9c/attachment.html 


More information about the torqueusers mailing list