[torqueusers] A install problem

DuChene, StevenX A stevenx.a.duchene at intel.com
Tue Apr 3 08:43:18 MDT 2012

I believe somewhere in the release notes it specifically states that your need openssl-devel installed.
Steven DuChene

From: torqueusers-bounces at supercluster.org [mailto:torqueusers-bounces at supercluster.org] On Behalf Of ??
Sent: Tuesday, April 03, 2012 6:25 AM
To: torqueusers at supercluster.org
Subject: [torqueusers] A install problem

I met a problem when I installed the torque.
Does any one can help me?

I run
$./make install

and get

make[3]: Entering directory `/home/martinliu/soft/torque/src/daemon_client'
/bin/sh ../../libtool  --tag=CC   --mode=link gcc -Wall -pthread -ldl -lrt -lssl -lcrypto -g -O2 -L../lib/Libpbs/.libs -ltorque  -o trqauthd trq_auth_daemon.o trq_main.o  -lpthread -lrt
libtool: link: gcc -Wall -pthread -g -O2 -o .libs/trqauthd trq_auth_daemon.o trq_main.o  -ldl -lssl -lcrypto -L/home/martinliu/soft/torque/src/lib/Libpbs/.libs /home/martinliu/soft/torque/src/lib/Libpbs/.libs/libtorque.so -lpthread -lrt -pthread
/usr/bin/ld: cannot find -lssl
/usr/bin/ld: cannot find -lcrypto
collect2: ld returned 1 exit status
make[3]: *** [trqauthd] Error 1
make[3]: Leaving directory `/home/martinliu/soft/torque/src/daemon_client'
make[2]: *** [install-recursive] Error 1
make[2]: Leaving directory `/home/martinliu/soft/torque/src/daemon_client'
make[1]: *** [install-recursive] Error 1
make[1]: Leaving directory `/home/martinliu/soft/torque/src'
make: *** [install-recursive] Error 1

-------------- next part --------------
An HTML attachment was scrubbed...
URL: http://www.supercluster.org/pipermail/torqueusers/attachments/20120403/213651c8/attachment.html 

More information about the torqueusers mailing list