[torqueusers] Compiling Torque in Cygwin

Darcy Quick dquick at evergrid.com
Wed Sep 10 10:24:52 MDT 2008


Has anyone had luck getting Torque working in Cygwin?  I need to run a 
pbs_mom on a Windows node.  There's no mention of it in the OS notes in 
INSTALL.

Configure options used:
 ./configure --disable-gcc-warnings

I got the following errors running make with torque 2.3.3:
 gcc -DHAVE_CONFIG_H -I. -I. -I../../../src/include 
-I../../../src/include -I../Libdis 
-DIFF_PATH=\"/usr/local/sbin/pbs_iff\" 
-DPBS_DEFAULT_FILE=\"/var/spool/torque/server_name\" -g -MT 
pbsD_connect.lo -MD -MP -MF .deps/pbsD_connect.Tpo -c 
../Libifl/pbsD_connect.c  -DPIC -o .libs/pbsD_connect.o
../Libifl/pbsD_connect.c: In function `send_unix_creds':
../Libifl/pbsD_connect.c:550: error: `SCM_CREDENTIALS' undeclared (first 
use in this function)
../Libifl/pbsD_connect.c:550: error: (Each undeclared identifier is 
reported only once
../Libifl/pbsD_connect.c:550: error: for each function it appears in.)
../Libifl/pbsD_connect.c:553: error: structure has no member named `cr_uid'
../Libifl/pbsD_connect.c:554: error: structure has no member named 
`cr_groups'
make[3]: *** [pbsD_connect.lo] Error 1
make[3]: Leaving directory `/home/dquick/torque-2.3.3/src/lib/Libpbs'
make[2]: *** [all-recursive] Error 1
make[2]: Leaving directory `/home/dquick/torque-2.3.3/src/lib'
make[1]: *** [all-recursive] Error 1
make[1]: Leaving directory `/home/dquick/torque-2.3.3/src'
make: *** [all-recursive] Error 1

Any help would be much appreciated.



More information about the torqueusers mailing list