[torqueusers] Torque Build Errors

Chris Vaughan chris at clusterresources.com
Fri Jul 4 06:24:34 MDT 2008


All,

I'm having torque compile errors with 2.3.1, disabling the gcc errors does
get around it though.

chris at wopr:~/torque-2.3.1$ gcc --version
gcc (GCC) 4.2.3 (Ubuntu 4.2.3-2ubuntu7)
Copyright (C) 2007 Free Software Foundation, Inc.
This is free software; see the source for copying conditions.  There is NO
warranty; not even for MERCHANTABILITY or FITNESS FOR A PARTICULAR PURPOSE.

cc1: warnings being treated as errors
start_exec.c: In function ‘std_file_name’:
start_exec.c:5289: warning: comparison with string literal results in
unspecified behaviour
make[3]: *** [start_exec.o] Error 1
make[3]: Leaving directory `/home/chris/torque-2.3.1/src/resmom'
make[2]: *** [all-recursive] Error 1
make[2]: Leaving directory `/home/chris/torque-2.3.1/src/resmom'
make[1]: *** [all-recursive] Error 1
make[1]: Leaving directory `/home/chris/torque-2.3.1/src'
make: *** [all-recursive] Error 1


-- 
Chris Vaughan
EMEA Systems Engineer
Cluster Resources, Ltd.
Direct - UK Office:  +44 (0)1223 437 132
Mobile - +44 (0)7800 973 062
US Headquarters:  +1 801 717 3700
Skype: supercomputer1
www.clusterresources.co.uk

Evaluate Our Products, Free 45-Day Evaluation
http://www.clusterresources.com/pages/products/evaluate.php
-------------- next part --------------
A non-text attachment was scrubbed...
Name: config.log
Type: application/octet-stream
Size: 115732 bytes
Desc: not available
Url : http://www.supercluster.org/pipermail/torqueusers/attachments/20080704/347a8042/config-0001.obj


More information about the torqueusers mailing list