[torqueusers] compilation of torque-1.2.0p6 on Mac Xserve G5 with OS X 10.4

Tatsuya Minami taminami at mac.com
Wed Sep 21 10:34:54 MDT 2005


Hello,
I did search but I couldn't find the solution for my problem.
I downloaded torque-1.2.0p6 and did ./configure.
The configure went through without any errors.
Then, I did "make" and I received the next errors.

gcc -g -I../include -I../../src/include -I./darwin -DHAVE_CONFIG_H -DPBS_MOM -DDEMUX=\"/usr/local/sbin/pbs_demux\" -DRCP_PATH=\"/usr/local/sbin/pbs_rcp\" -c ./darwin/mom_mach.c
./darwin/mom_mach.c: In function 'mem_sum':
./darwin/mom_mach.c:570: error: 'struct vmspace' has no member named 'vm_tsize'
./darwin/mom_mach.c:570: error: 'struct vmspace' has no member named 'vm_dsize'
./darwin/mom_mach.c:570: error: 'struct vmspace' has no member named 'vm_ssize'
./darwin/mom_mach.c: In function 'resi_sum':
./darwin/mom_mach.c:621: error: 'struct vmspace' has no member named 'vm_rssize'./darwin/mom_mach.c:623: error: 'struct vmspace' has no member named 'vm_rssize'./darwin/mom_mach.c: In function 'overmem_proc':
./darwin/mom_mach.c:670: error: 'struct vmspace' has no member named 'vm_tsize'
./darwin/mom_mach.c:670: error: 'struct vmspace' has no member named 'vm_dsize'
./darwin/mom_mach.c:670: error: 'struct vmspace' has no member named 'vm_ssize'
./darwin/mom_mach.c: In function 'bs_cmp':
./darwin/mom_mach.c:958: error: dereferencing pointer to incomplete type
./darwin/mom_mach.c: In function 'mom_get_sample':
./darwin/mom_mach.c:1093: error: storage size of 'ss' isn't known
./darwin/mom_mach.c:1135: warning: passing argument 4 of 'qsort' from incompatible pointer type
./darwin/mom_mach.c:1167: warning: passing argument 5 of 'bsearch' from incompatible pointer type
./darwin/mom_mach.c: In function 'cput_job':
./darwin/mom_mach.c:1636: warning: comparison between pointer and integer
./darwin/mom_mach.c: In function 'cput_proc':
./darwin/mom_mach.c:1703: warning: comparison between pointer and integer
./darwin/mom_mach.c: In function 'mem_job':
./darwin/mom_mach.c:1834: error: 'struct vmspace' has no member named 'vm_tsize'./darwin/mom_mach.c:1835: error: 'struct vmspace' has no member named 'vm_dsize'./darwin/mom_mach.c:1836: error: 'struct vmspace' has no member named 'vm_ssize'./darwin/mom_mach.c: In function 'mem_proc':
./darwin/mom_mach.c:1898: error: 'struct vmspace' has no member named 'vm_tsize'./darwin/mom_mach.c:1899: error: 'struct vmspace' has no member named 'vm_dsize'./darwin/mom_mach.c:1900: error: 'struct vmspace' has no member named 'vm_ssize'./darwin/mom_mach.c: In function 'resi_job':
./darwin/mom_mach.c:1996: error: 'struct vmspace' has no member named 'vm_rssize'
./darwin/mom_mach.c: In function 'resi_proc':
./darwin/mom_mach.c:2051: error: 'struct vmspace' has no member named 'vm_rssize'
./darwin/mom_mach.c: In function 'walltime':
./darwin/mom_mach.c:2878: warning: comparison between pointer and integer
./darwin/mom_mach.c: In function 'quota':
./darwin/mom_mach.c:3053: warning: comparison between pointer and integer
make[3]: *** [mom_mach.o] Error 1
make[2]: *** [all] Error 2
make[1]: *** [all] Error 2
make: *** [all] Error 2


A machine I am trying is Mac Xserve G5. OS is Mac OS X server 10.4.2.
Has anybody run into the same problem? Is there any solution for this problem?

Thank you in advance,
Tatsuya



More information about the torqueusers mailing list