[torqueusers] make error - array type

Paul Van Allsburg vanallsburg at hope.edu
Wed Nov 2 11:54:51 MST 2005


In setting up a test cluster to resemble an existing production system I 
ran into a install error on 'make'
shown below.  The pc is FC4, torque-1.2.0p2

[root at fischer torque-1.2.0p2]#./configure --disable-gui 
--set-server-home=/var/spool/PBS --set-default-server=`hostmane -s`

[root at fischer torque-1.2.0p2]#make

<chop>
.
.
.
In file included from mom_server.c:113:
../include/pbs_nodes.h:199: error: array type has incomplete element type
make[3]: *** [mom_server.o] Error 1
make[3]: Leaving directory `/home/vanallp/torque/torque-1.2.0p2/src/resmom'
make[2]: *** [all] Error 2
make[2]: Leaving directory `/home/vanallp/torque/torque-1.2.0p2/src/resmom'
make[1]: *** [all] Error 2
make[1]: Leaving directory `/home/vanallp/torque/torque-1.2.0p2/src'
make: *** [all] Error 2
[root at fischer torque-1.2.0p2]#

Any obvious fix come to mind?

Thanks,
-- 
Paul Van Allsburg




More information about the torqueusers mailing list