[torqueusers] Problem in Installing OpenPBS on the slave node

Kashif Saleem saleemk at dcs.gla.ac.uk
Wed Aug 24 17:18:18 MDT 2005


Dear All,
         I am getting the following error while installing the OpenPBS on the compute node.I mounted the server /home directory of labpc-17.nesc.gla.ac.uk machine  to the slave node(labpc-18.nesc.gla.ac.uk) for passwordless  communication between them as mentioned in the following article http://www.linuxgazette.com/node/9480.

Then I successfully installed the OpenPBS server on the labpc-17.nesc.gla.ac.uk.
But when I tried to install OpenPBS on the slave machine(labpc-18.nesc.gla.ac.uk) with the following configuration it gave the following error while running "make" as shown below:


[root at labpc-18 OpenPBS_2_3_16]# ./configure --disable-gui --set-server-home=/var /spool/PBS --disable-server --set-default-server=labpc-17.nesc.gla.ac.uk --set-s ched=no
loading cache ./config.cache
checking host system type... i686-pc-linux-gnu
checking PBS machine type... (cached) linux
checking for sendmail... (cached) /usr/lib/sendmail
checking for flex... (cached) flex
checking for yywrap in -lfl... (cached) yes
checking whether ln -s works... (cached) yes
checking whether make sets ${MAKE}... (cached) yes
checking for ranlib... (cached) ranlib
checking for bison... (cached) bison -y
checking for the install-sh script... ./buildutils/install-sh -c
checking for gtbl... (cached) gtbl
checking for gpic... (cached) gpic
checking for groff... (cached) groff
checking whether make understands '.POSIX:'... (cached) yes
checking whether make understands an initial '+'... (cached) yes
checking for gcc... (cached) gcc
checking whether the C compiler (gcc  ) works... yes
checking whether the C compiler (gcc  ) is a cross-compiler... no
checking whether we are using GNU C... (cached) yes
checking whether gcc accepts -g... (cached) yes
checking size of int... (cached) 4
checking size of long... (cached) 4
checking size of float... (cached) 4
checking size of double... (cached) 8
checking size of long double... (cached) 12
checking size of short... (cached) 2
checking size of unsigned... (cached) 4
checking size of unsigned int... (cached) 4
checking size of unsigned short... (cached) 2
checking size of unsigned char... (cached) 1
checking size of unsigned long... (cached) 4
checking size of signed char... (cached) 1
checking how to run the C preprocessor... (cached) gcc -E
checking whether char is unsigned... (cached) no
checking for h_errno declaration in netdb.h... (cached) yes
checking for FD_SET eclaration in sys/select.h... (cached) yes
checking for setresuid... (cached) yes
checking for setresgid... (cached) yes
checking for seteuid... (cached) yes
checking for setegid... (cached) yes
checking for xdr_int in -lc... (cached) yes
checking for ruserok in -lc... (cached) yes
checking for nlist in -lc... (cached) no
checking for nlist in -lelf... (cached) no
checking for kvm_open in -lkvm... (cached) no
checking for dlopen in -ldl... (cached) yes
checking for sys/ioctl.h... (cached) yes
checking whether gcc needs -traditional... (cached) no
checking for atexit... (cached) yes
creating ./config.status
creating buildutils/pbs_mkdirs
creating buildutils/mkincludes/cleanup.mk
creating buildutils/mkincludes/dirs.mk
creating buildutils/mkincludes/docplan.mk
creating buildutils/mkincludes/lib.mk
creating buildutils/mkincludes/head.mk
creating buildutils/mkincludes/tail.mk
creating buildutils/mkincludes/tcl.mk
creating buildutils/Makefile
creating ./Makefile
creating src/Makefile
creating src/server/Makefile
creating src/include/Makefile
creating src/iff/Makefile
creating src/scheduler.tcl/Makefile
creating src/tools/Makefile
creating src/tools/xpbsmon/Makefile
creating src/lib/Makefile
creating src/gui/Makefile
creating src/gui/Ccode/Makefile
creating src/cmds/Makefile
creating src/scheduler.basl/Makefile
creating src/scheduler.cc/Makefile
creating src/scheduler.cc/samples/do_not_delete
creating src/scheduler.cc/samples/fifo/Makefile
creating src/resmom/Makefile
creating src/mom_rcp/Makefile
creating src/lib/Libattr/Makefile
creating src/lib/Libcmds/Makefile
creating src/lib/Libpbs/Makefile
creating src/lib/Libdis/Makefile
creating src/lib/Libifl/Makefile
creating src/lib/Liblog/Makefile
creating src/lib/Libnet/Makefile
creating src/lib/Libsite/Makefile
creating doc/Makefile
creating doc/ers/Makefile
creating ./src/include/pbs_config.h
[root at labpc-18 OpenPBS_2_3_16]# make
make[1]: Entering directory `/usr/local/OpenPBS_2_3_16/doc'
make[1]: `soelim' is up to date.
make[1]: Leaving directory `/usr/local/OpenPBS_2_3_16/doc'
Making all in src
make[1]: Entering directory `/usr/local/OpenPBS_2_3_16/src'
Making all in include
make[2]: Entering directory `/usr/local/OpenPBS_2_3_16/src/include'
make[2]: Leaving directory `/usr/local/OpenPBS_2_3_16/src/include'
Making all in lib
make[2]: Entering directory `/usr/local/OpenPBS_2_3_16/src/lib'
Making all in Libattr
make[3]: Entering directory `/usr/local/OpenPBS_2_3_16/src/lib/Libattr'
generating dependencies
makedepend-sh: processing ./attr_atomic.c
makedepend-sh: processing ./attr_fn_acl.c
makedepend-sh: processing ./attr_fn_arst.c
makedepend-sh: processing ./attr_fn_b.c
makedepend-sh: processing ./attr_fn_c.c
makedepend-sh: processing ./attr_fn_hold.c
makedepend-sh: processing ./attr_fn_intr.c
makedepend-sh: processing ./attr_fn_l.c
makedepend-sh: processing ./attr_fn_ll.c
makedepend-sh: processing ./attr_fn_resc.c
makedepend-sh: processing ./attr_fn_size.c
makedepend-sh: processing ./attr_fn_str.c
makedepend-sh: processing ./attr_fn_time.c
makedepend-sh: processing ./attr_fn_unkn.c
makedepend-sh: processing ./attr_func.c
makedepend-sh: processing ./attr_node_func.c
makedepend-sh: processing ./Long_.c
makedepend-sh: processing ./LTostr.c
makedepend-sh: processing ./uLTostr.c
makedepend-sh: processing ./strToL.c
makedepend-sh: processing ./strTouL.c
make[4]: Entering directory `/usr/local/OpenPBS_2_3_16/src/lib/Libattr'
make[4]: *** No rule to make target `<built-in>', needed by `attr_atomic.o'.  St op.
make[4]: Leaving directory `/usr/local/OpenPBS_2_3_16/src/lib/Libattr'
make[3]: *** [all] Error 2
make[3]: Leaving directory `/usr/local/OpenPBS_2_3_16/src/lib/Libattr'
make[2]: *** [all] Error 2
make[2]: Leaving directory `/usr/local/OpenPBS_2_3_16/src/lib'
make[1]: *** [all] Error 2
make[1]: Leaving directory `/usr/local/OpenPBS_2_3_16/src'
make: *** [all] Error 2




I would really thankfull if someone could tell me the possible cause of this error.


Kind Regards
Kashif Saleem.
-------------- next part --------------
An HTML attachment was scrubbed...
URL: http://www.supercluster.org/pipermail/torqueusers/attachments/20050825/9399a989/attachment.html


More information about the torqueusers mailing list