Bug 71 - Unable to compile on CentOS 5.5
: Unable to compile on CentOS 5.5
Status: RESOLVED FIXED
Product: TORQUE
libtorque
: 2.5.x
: PC Linux
: P5 critical
Assigned To: Glen
:
:
:
  Show dependency treegraph
 
Reported: 2010-07-20 13:26 MDT by Peter Schmitt
Modified: 2010-07-22 11:16 MDT (History)
2 users (show)

See Also:


Attachments
config.log from configure (135.23 KB, text/x-log)
2010-07-20 13:26 MDT, Peter Schmitt
Details


Note

You need to log in before you can comment on or make changes to this bug.


Description Peter Schmitt 2010-07-20 13:26:37 MDT
Created an attachment (id=41) [details]
config.log from configure

Get the following during the make...

 gcc -DHAVE_CONFIG_H -I. -I. -I../../../src/include -I../../../src/include
-I../../../src/lib/Libdis -DIFF_PATH=\"/opt/torque/2.5.0/sbin/pbs_iff\"
-DPBS_DEFAULT_FILE=\"/var/spool/torque/server_name\" -fPIC -W -Wall
-Wno-unused-parameter -Wno-long-long -pedantic -Werror -D_LARGEFILE64_SOURCE
-MT net_client.lo -MD -MP -MF .deps/net_client.Tpo -c ../Libnet/net_client.c 
-fPIC -DPIC -o .libs/net_client.o
cc1: warnings being treated as errors
../Libnet/net_client.c: In function 'client_to_svr':
../Libnet/net_client.c:276: warning: unused variable 'errorsock'
make[3]: *** [net_client.lo] Error 1
make[3]: Leaving directory
`/root/pkgs/torque/2.5.0/torque-2.5.0_centos5.x86_64/src/lib/Libpbs'
make[2]: *** [all-recursive] Error 1
make[2]: Leaving directory
`/root/pkgs/torque/2.5.0/torque-2.5.0_centos5.x86_64/src/lib'
make[1]: *** [all-recursive] Error 1
make[1]: Leaving directory
`/root/pkgs/torque/2.5.0/torque-2.5.0_centos5.x86_64/src'
make: *** [all-recursive] Error 1
Comment 1 Garrick Staples 2010-07-22 11:16:09 MDT
Fixed in 2.5.1